{"text_format":"1","workbook":"xlsx","n_sheets":6,"sheets":["DASHBOARD","Mapping","Definitions Category","Definitions Pedagogy","Definitions Training","Definitions LIT stripped"],"not_rendered":{"charts":0,"images":1,"macros":1,"external_links":0,"defined_names":11,"comments":0,"pivot_tables":0},"unopened":[],"bounds":{"document_bytes":16777216,"sheet_cells":100000,"rows_first":2000,"rows_last":500,"rows_between":2000,"halvings":0,"cell_chars":16384,"cell_head_chars":4096},"cells_cut":0,"cells_raw":0,"read":"whole","date_system":"1900"}

{"sheet":"DASHBOARD","index":0,"n_rows":30,"n_cols":4,"rows_kept":30,"cut":false,"hidden":false,"merged":[[25,1,26,4],[11,0,17,0],[7,0,10,0],[24,0,27,0],[8,1,9,4]]}
[]
[]
[]
[]
[]
[]
["EDUCATIONAL TECHNOLOGY DASHBOARD 2.0"]
[null,"How to use this tool"]
[null,"This tool is designed to help you identify appropriate educational technology solutions for your course. Sort by problems of practice, pedagogical approach, curriculum design needs, Bloom's Taxonomy Level, or online alternatives to in-class approaches"]
[]
{"$rows_left_out":21}
{"sheet":"Mapping","index":1,"n_rows":51,"n_cols":13,"rows_kept":51,"cut":false,"hidden":true,"merged":[]}
["Source","Problem of Practice Name","Category","Explanation","Underlying Reasons","Tech/LIT Category","Professional Development Modules","CourseModules","Notes","Column1","Column2","IntroModules","Column3"]
["Kate","Students cannot conveniently access the course content","Access & Technology","Make sure to use the LMS and standardized softawre and hardware requirements to ensure centralized access to the course tools and materials. Consider if local providers like libraries and community colleges may have internet access or other resources that can help your students access your course more easily.","1.  Centralized access to tools and course materials.  2. Lack of reliable internet access, hardware difference or failures","LMS; StandardHardware;StandardPartners","Risk","Module2;Module4;Module6",null,{"$f":"Lookup_concat($F2,'Definitions LIT stripped'!$A$1:$A$200,'Definitions LIT stripped'!$B$1:$B$200)","v":"Integrated Digital Curriculum and Formative Assessment to Enable Student-Centered Learning ; Local and regional partners"},{"$f":"Lookup_concat($F2,'Definitions LIT stripped'!$A$1:$A$22,'Definitions LIT stripped'!$D$1:$D$22)","v":"LMS spaces such as Canvas, Blackboard, Sakai, or Moodle; Libraries or community colleges for internet or device access"},{"$f":"IFERROR(Lookup_concat($H2,'Definitions Training'!$A$18:$A$24,'Definitions Training'!$B$18:$B$24),\"None specified\")","v":"Module 2: Foundational Concepts; Module 4: Synchonicity Plan; Module 6: Instructional Strategies"},{"$f":"IFERROR(Lookup_concat($G2,'Definitions Training'!$A$2:$A$14,'Definitions Training'!$B$2:$B$144),\"None specified\")","v":"Creating risk-taking skills in students"}]
["Ellen","Students cannot conveniently access the professor outside of class","Access & Technology","Use LMS tools, forums, and other collaborative spaces to meet with students. Clearly articulate office hours and preferred methods of contact.","1. No clear articulation of  office hours. 2. No clear preferred method or preferred method is inaccessible","eCollabMeeting;Forums;eCollabWork","Engagement;Help","Module4;Module7",null,{"$f":"Lookup_concat($F3,'Definitions LIT stripped'!$A$1:$A$200,'Definitions LIT stripped'!$B$1:$B$200)","v":"e-Collaborative Learning; Forums; Collaborative workspace"},{"$f":"Lookup_concat($F3,'Definitions LIT stripped'!$A$1:$A$200,'Definitions LIT stripped'!$D$1:$D$200)","v":"Zoom, WebEx, or GoogleMeet; LMS discussion forums, or Piazza or Padlet; GoogleSuite, blogs, or Wikis"},{"$f":"IFERROR(Lookup_concat($H3,'Definitions Training'!$A$18:$A$24,'Definitions Training'!$B$18:$B$24),\"None specified\")","v":"Module 4: Synchonicity Plan; Module 7: Student Interactions"},{"$f":"IFERROR(Lookup_concat($G3,'Definitions Training'!$A$2:$A$14,'Definitions Training'!$B$2:$B$144),\"None specified\")","v":"Teaching/Student Engagement; Helping students seek appropriate support after poor performance or lack of topic interest"}]
[null,"Some students have trouble with online materials due to impairment or disability","Access & Technology","Ensure you are following best practices for accessibility of digital written and video materials, including transcripting, alternative text for visual material, and multiple modes of content delivery. Accessibility tools are available for LMS and many other programs to support you.",null,"LMSaccess","CourseDevPolicy;Accessibility","Module4;Module6",null,{"$f":"Lookup_concat($F4,'Definitions LIT stripped'!$A$1:$A$200,'Definitions LIT stripped'!$B$1:$B$200)","v":"Educational Accessibility and Personalization "},{"$f":"Lookup_concat($F4,'Definitions LIT stripped'!$A$1:$A$200,'Definitions LIT stripped'!$D$1:$D$200)","v":"CanvasAlly or AccessibilityTools within standard software (e.g. PowerPoint translation)"},{"$f":"IFERROR(Lookup_concat($H4,'Definitions Training'!$A$18:$A$24,'Definitions Training'!$B$18:$B$24),\"None specified\")","v":"Module 4: Synchonicity Plan; Module 6: Instructional Strategies"},{"$f":"IFERROR(Lookup_concat($G4,'Definitions Training'!$A$2:$A$14,'Definitions Training'!$B$2:$B$144),\"None specified\")","v":"Course Development: Policies nd course management; Making the classroom accessible"}]
[null,"I or my students don't have the technical skill to create online materials","Access & Technology","Many programs have templates and tutorials available to help you get up to speed quickly. Many of your existing materials can be used if they are placed in the LMS. Use guidelines from QualityMatters, UNC SO training courses, and your university faculty development for more guidance on getting your course online quickly.",null,"Templates","CourseDevContent;Risk","Module1;Module4",null,{"$f":"Lookup_concat($F5,'Definitions LIT stripped'!$A$1:$A$200,'Definitions LIT stripped'!$B$1:$B$200)","v":"Scaling Pedagogical Knowledge and Practice"},{"$f":"Lookup_concat($F5,'Definitions LIT stripped'!$A$1:$A$200,'Definitions LIT stripped'!$D$1:$D$200)","v":"QualityMatters guidelines, instructor-created templates, or Faculty Development Training resources"},{"$f":"IFERROR(Lookup_concat($H5,'Definitions Training'!$A$18:$A$24,'Definitions Training'!$B$18:$B$24),\"None specified\")","v":"Module 1: Welcome and Introduction; Module 4: Synchonicity Plan"},{"$f":"IFERROR(Lookup_concat($G5,'Definitions Training'!$A$2:$A$14,'Definitions Training'!$B$2:$B$144),\"None specified\")","v":"Course Development: Content and Assignments; Creating risk-taking skills in students"}]
["CMU","Students behave rudely in class.","Student Behavior","Rudeness thrives in anonymity. Use tools designed to promote student engagement and interactions with other students and the faculty to reduce this behavior.","1. Anonymity enables inappropriate behavior.","Forums","Engagement","Module7","use moderating capacity",{"$f":"Lookup_concat($F6,'Definitions LIT stripped'!$A$1:$A$200,'Definitions LIT stripped'!$B$1:$B$200)","v":"Forums"},{"$f":"Lookup_concat($F6,'Definitions LIT stripped'!$A$1:$A$200,'Definitions LIT stripped'!$D$1:$D$200)","v":"LMS discussion forums, or Piazza or Padlet"},{"$f":"IFERROR(Lookup_concat($H6,'Definitions Training'!$A$18:$A$24,'Definitions Training'!$B$18:$B$24),\"None specified\")","v":"Module 7: Student Interactions"},{"$f":"IFERROR(Lookup_concat($G6,'Definitions Training'!$A$2:$A$14,'Definitions Training'!$B$2:$B$144),\"None specified\")","v":"Teaching/Student Engagement"}]
["CMU","Students cheat on assignments and exams.","Student Behavior","Students are more likely to cheat in conditions where they perceive they are anonymous and won't get caught, or circumstances where there are a few high-stakes assessments. In addition to course design strategies to promote academic integrity, several tools exist for plagiarism detection, grading, and procotoring. Most collaborative workspaces also allow version control and monitoring to understand student contributions to group work.","1.  Students might perceive the possibility to cheat without getting caught.  2.  Students are more likely to cheat when they feel anonymous in class.","Security;eCollabWork;eCollabShare","Engagement;Motivate;Help","Module5",null,{"$f":"Lookup_concat($F7,'Definitions LIT stripped'!$A$1:$A$200,'Definitions LIT stripped'!$B$1:$B$200)","v":"Security, plagiarism screening, proctoring; Collaborative workspace; Collaborative sharespaces and repositories"},{"$f":"Lookup_concat($F7,'Definitions LIT stripped'!$A$1:$A$200,'Definitions LIT stripped'!$D$1:$D$200)","v":"TurnItIn plagiarism detection or online proctoring such as Respondus or Examity; GoogleSuite, blogs, or Wikis; GitHub or online portfolios"},{"$f":"IFERROR(Lookup_concat($H7,'Definitions Training'!$A$18:$A$24,'Definitions Training'!$B$18:$B$24),\"None specified\")","v":"Module 5: Assessments"},{"$f":"IFERROR(Lookup_concat($G7,'Definitions Training'!$A$2:$A$14,'Definitions Training'!$B$2:$B$144),\"None specified\")","v":"Teaching/Student Engagement; Motivating students; Helping students seek appropriate support after poor performance or lack of topic interest"}]
[null,"I don't know how to align my course with external curriculum standards","Curriculum Design","Several tools, such as concept and curriculum mapping tools, exist to map your course and curriculum concept and learning outcomes to ensure they are aligned.",null,"Curriculum","CourseDevContent","Module3",null,{"$f":"Lookup_concat($F8,'Definitions LIT stripped'!$A$1:$A$200,'Definitions LIT stripped'!$B$1:$B$200)","v":"Visual curriculum or concept mapping"},{"$f":"Lookup_concat($F8,'Definitions LIT stripped'!$A$1:$A$200,'Definitions LIT stripped'!$D$1:$D$200)","v":"Mindmap or CourseTune concept mapping tools"},{"$f":"IFERROR(Lookup_concat($H8,'Definitions Training'!$A$18:$A$24,'Definitions Training'!$B$18:$B$24),\"None specified\")","v":"Module 3: Course Analysis"},{"$f":"IFERROR(Lookup_concat($G8,'Definitions Training'!$A$2:$A$14,'Definitions Training'!$B$2:$B$144),\"None specified\")","v":"Course Development: Content and Assignments"}]
[null,"I don't know how to match concepts to learning objectives","Curriculum Design","Several tools, such as concept and curriculum mapping tools, exist to map your course and curriculum concept and learning outcomes to ensure they are aligned.",null,"Curriculum","CourseDevContent","Module3",null,{"$f":"Lookup_concat($F9,'Definitions LIT stripped'!$A$1:$A$200,'Definitions LIT stripped'!$B$1:$B$200)","v":"Visual curriculum or concept mapping"},{"$f":"Lookup_concat($F9,'Definitions LIT stripped'!$A$1:$A$200,'Definitions LIT stripped'!$D$1:$D$200)","v":"Mindmap or CourseTune concept mapping tools"},{"$f":"IFERROR(Lookup_concat($H9,'Definitions Training'!$A$18:$A$24,'Definitions Training'!$B$18:$B$24),\"None specified\")","v":"Module 3: Course Analysis"},{"$f":"IFERROR(Lookup_concat($G9,'Definitions Training'!$A$2:$A$14,'Definitions Training'!$B$2:$B$144),\"None specified\")","v":"Course Development: Content and Assignments"}]
[null,"I don't know how my class fits into the whole curriculum","Curriculum Design","Several tools, such as concept and curriculum mapping tools, exist to map your course and curriculum concept and learning outcomes to ensure they are aligned.",null,"Curriculum","CourseDevContent","Module3",null,{"$f":"Lookup_concat($F10,'Definitions LIT stripped'!$A$1:$A$200,'Definitions LIT stripped'!$B$1:$B$200)","v":"Visual curriculum or concept mapping"},{"$f":"Lookup_concat($F10,'Definitions LIT stripped'!$A$1:$A$200,'Definitions LIT stripped'!$D$1:$D$200)","v":"Mindmap or CourseTune concept mapping tools"},{"$f":"IFERROR(Lookup_concat($H10,'Definitions Training'!$A$18:$A$24,'Definitions Training'!$B$18:$B$24),\"None specified\")","v":"Module 3: Course Analysis"},{"$f":"IFERROR(Lookup_concat($G10,'Definitions Training'!$A$2:$A$14,'Definitions Training'!$B$2:$B$144),\"None specified\")","v":"Course Development: Content and Assignments"}]
{"$rows_left_out":42}
{"sheet":"Definitions Category","index":2,"n_rows":13,"n_cols":1,"rows_kept":13,"cut":false,"hidden":true,"merged":[]}
["Category"]
[]
["Access_and_Technology"]
["Student_Behavior"]
["Engagement"]
["Interaction"]
["Student_Performance"]
["Student_Preparation"]
["Privacy"]
["Pedagogy"]
{"$rows_left_out":4}
{"sheet":"Definitions Pedagogy","index":3,"n_rows":13,"n_cols":5,"rows_kept":13,"cut":false,"hidden":true,"merged":[]}
["Pedagogical Approach","Explanation","Satisfactory","Good","Very Good"]
["Open-Ended Instruction","Lessons are structured so that multiple/complex answers are possible: students are not simply steered toward one “right” answer.","n/a","n/a","n/a"]
["Integrated Learning","Learning brings together content and skills  from more than one  subject area","content from a number of different  subject areas is readily identifiable","resource is appropriate for use in more than one subject area","the lines between subjects are blurred "]
["Inquiry Learning","Learning is directed by questions, problems, or challenges that students work to address.   ","Students are provided with questions/problems to solve and some direction on how to arrive at solutions.","students, assisted by the teacher clarify the question(s) to ask and the process to follow to arrive at solutions.  Sometimes referred to as Guided Inquiry","students generate the questions and assume much of the responsibility for how to solve them.  . Sometimes referred to as self-directed learning."]
["Differentiated Instruction","Activities address a range of student learning styles, abilities and readiness.","includes a variety of instructional approaches","addresses  the needs of visual, auditory &  kinesthetic learners","also includes strategies for learners with difficulties"]
["Experiential Learning","Authentic learning experiences are provided","learning is made concrete.  ‘Working with real objects,  using real sources of information","learning takes place in a real-world context. Simulation, mentorship","learning provides experience beyond the classroom. Addressing real world issues and problems "]
["Co-operative Learning","Group and cooperative learning strategies are a priority.","students work in groups;","cooperative learning skills are explicitly taught and practiced","cooperative learning skills are explicitly taught, practiced and assessed "]
["Assessment & Evaluation of Student Learning","Tools are provided that help students and teachers to capture formative and summative information about students' learning and performance. These tools may include reflection questions, checklists, rubrics, etc.","n/a","n/a","n/a"]
["Peer Teaching","Provides opportunities for students to actively present their knowledge and skills to peers and/or act as teachers and mentors.","incidental teaching that arises from cooperative learning, presentations, etc.;","an opportunity is intentionally created to empower students to teach other students/community members. The audience is somehow reliant on the students’ teaching (students are not simply ‘presenting’)","an opportunity is intentionally created to empower students to teach other students/community members. The audience is somehow reliant on the students’ teaching (students are not simply ‘presenting’)"]
["Case Studies","Relevant case studies are included.  Case studies are thorough descriptions of real events from real situations that students use to explore  concepts in an authentic context.","n/a","n/a","n/a"]
{"$rows_left_out":4}
{"sheet":"Definitions Training","index":4,"n_rows":24,"n_cols":2,"rows_kept":24,"cut":false,"hidden":true,"merged":[]}
["Abbreviations","Module title"]
["Risk","Creating risk-taking skills in students"]
["Engagement","Teaching/Student Engagement"]
["Help","Helping students seek appropriate support after poor performance or lack of topic interest"]
["Motivate","Motivating students"]
["CritThinking","Developing student's Critical Thinking skills"]
["Evaluations","Evaluations"]
["Background","Supporting students who have inadequate preparation"]
["PedagogyBest","Pedagogical Best Practices"]
["PedagogyOnline","Transitioning pedagogy to the online classroom"]
{"$rows_left_out":15}
{"sheet":"Definitions LIT stripped","index":5,"n_rows":27,"n_cols":4,"rows_kept":27,"cut":false,"hidden":true,"merged":[]}
["Shorthand","Learning impact trend category","Shorthand","Examples"]
["Adaptive","Adaptive Learning & Online Homework ","Adaptive learning","CogBooks, RealizeIt, or SmartSparrow"]
["eText","Digital Resource, eText and Learning App Innovation","eText","OpenStacks"]
["eCollabMeeting","e-Collaborative Learning","eCollabMeeting","Zoom, WebEx, or GoogleMeet"]
["VR/AR","Gaming, Simulation, and Immersive Learning","VR/AR","360 video, Oculus, Hololens, GoogleCardboard"]
["Templates","Scaling Pedagogical Knowledge and Practice","Templates","QualityMatters guidelines, instructor-created templates, or Faculty Development Training resources"]
["Blended","Blended Learning Optimization","Blended","TEST"]
["DLN","Digital Learning Networks","DLN","TEST"]
["LMSaccess","Educational Accessibility and Personalization ","LMSaccess","CanvasAlly or AccessibilityTools within standard software (e.g. PowerPoint translation)"]
["LMS","Integrated Digital Curriculum and Formative Assessment to Enable Student-Centered Learning ","LMS","LMS spaces such as Canvas, Blackboard, Sakai, or Moodle"]
{"$rows_left_out":17}